{"text_format":"1","workbook":"xlsx","n_sheets":25,"sheets":["Start","Tab0","Tab1","Tab2","Tab3","Tab4","Tab5","Tab6","VNS1","VNS2","VNS3","VNS4","AusAn","Aufteilung","Betreuer","Updates","Liste","transfer","VB_B","VB_F","Modul_Test","VBDial","VBSeit","VBPlan","Rechenhilfe Beleg"],"not_rendered":{"charts":0,"images":3,"macros":1,"external_links":0,"defined_names":26,"comments":2,"pivot_tables":3},"unopened":[{"sheet":"VB_B","index":18,"reason":"part_missing"},{"sheet":"VB_F","index":19,"reason":"part_missing"},{"sheet":"Modul_Test","index":20,"reason":"part_missing"},{"sheet":"VBDial","index":21,"reason":"part_missing"},{"sheet":"VBSeit","index":22,"reason":"part_missing"},{"sheet":"VBPlan","index":23,"reason":"part_missing"}],"bounds":{"document_bytes":16777216,"sheet_cells":100000,"rows_first":2000,"rows_last":500,"rows_between":2000,"halvings":0,"cell_chars":16384,"cell_head_chars":4096},"cells_cut":0,"cells_raw":0,"read":"whole","date_system":"1900"}

{"sheet":"Start","index":0,"n_rows":1,"n_cols":1,"rows_kept":1,"cut":false,"hidden":false,"merged":[]}
[1]

{"sheet":"Tab0","index":1,"n_rows":10,"n_cols":2,"rows_kept":10,"cut":false,"hidden":false,"merged":[]}
[]
[null,"Betriebsdaten"]
[]
[null,"Kostenbelege"]
[]
[null,"Finanzmittel"]
[]
[null,"Verwendungs-nachweis"]
[]
[null,"Auszahlungs-antrag"]

{"sheet":"Tab1","index":2,"n_rows":72,"n_cols":34,"rows_kept":72,"cut":false,"hidden":false,"merged":[[28,8,28,10],[45,4,45,7]]}
[null,null,null,null,null,null,null,null,null,null,null,null,null,null,null,"Kostengruppe","Ber.","Ausgabengruppen",null,null,"Nr.","Finanzen",null,"Num","AusGruppen",null,"Num","Kreisstellen",null,null,"Ausgabenkomp",null,null,"keine Angabe"]
[null,null,"Skonto%",1,1,"UST%;USt€",null,null,null,null,null,null,11,1,11,"GAK: Errichtung, Modernisierung",1,"Errichtung (GAK)",null,null,1,"Zuschuss GAKG",1,1,"GAK Landkauf, Grundstück",null,1,"Aachen","VE Düren",1,{"$f":"O2&\" \" &P2","v":"11 GAK: Errichtung, Modernisierung"},null,"Aachen","VE Düren"]
[null,null,null,1,1,19,null,null,null,null,null,null,21,2,21,"GAK: Kauf Maschinen/Anlagen",2,"Maschinen Anlagen (GAK)",null,null,2,"Zuschuss Organisationausgaben",2,2,"GAK Erschließung",null,2,"Borken","VE Borken",2,"21 GAK: Kauf Maschinen/Anlagen",null,"Borken","VE Borken"]
[null,null,null,2018,2018,null,null,null,null,null,null,null,31,3,31,"GAK: Allg. Aufwand: Architekt",3,"Allg. Aufwand (GAK)",null,null,3,"Zuschuss Ausstattung/Einrichtung",3,3,"GAK Bauwerk / Konstruktion",null,3,"Coesfeld","VE Coesfeld",3,"31 GAK: Allg. Aufwand: Architekt",null,"Coesfeld","VE Coesfeld"]
[null,null,null,{"$f":"DATE(D4,D3,D2)","v":"2018-01-01"},{"$f":"DATE(E4,E3,E2)","v":"2018-01-01"},null,null,null,null,null,null,null,32,4,32,"GAK: Allg. Aufwand: Ingenieurl.",3,"Allg. Aufwand (GAK)",null,null,4,"Zuschuss Marketingmaßnahmen",4,4,"GAK Bauwerk / Techn. Anlagen",null,4,"Düren","VE Düren",4,"32 GAK: Allg. Aufwand: Ingenieurl.",null,"Düren","VE Düren"]
[{"$f":"D22","v":1},null,null,{"$f":"D5","v":"2018-01-01"},{"$f":"E5","v":"2018-01-01"},null,0,0,0,0,0,null,33,5,33,"GAK: Allg. Aufwand: Beratung",3,"Allg. Aufwand (GAK)",null,null,5,"Zuschuss Startbeihilfen 1. Jahr",5,5,"GAK Außenanlagen",null,5,"Euskirchen","VE Düren",5,"33 GAK: Allg. Aufwand: Beratung",null,"Euskirchen","VE Düren"]
["Buchung","Beleg","DIN","R-Datum","Z-Datum","Aussteller Zweck","Ausgabe","nicht-Skont.","nzfBetr Netto","anteilUSt","Netto",null,34,6,34,"GAK: Allg. Aufwand: Lizenzen",3,"Allg. Aufwand (GAK)",null,null,6,"Zuschuss Startbeihilfen 2. Jahr",6,6,"GAK Ausstattung",null,6,"Gütersloh","VE Warendorf",6,"34 GAK: Allg. Aufwand: Lizenzen",null,"Gütersloh","VE Warendorf"]
[null,null,null,null,null,"",null,null,null,null,null,null,35,7,35,"GAK: Allg. Aufw: Baunebenkosten",3,"Allg. Aufwand (GAK)",null,null,7,"Zuschuss Startbeihilfen 3. Jahr",7,7,"Nebenkosten",null,7,"Heinsberg","VE Viersen",7,"35 GAK: Allg. Aufw: Baunebenkosten",null,"Heinsberg","VE Viersen"]
[null,{"$f":"\"Betrieb: \"& D10 &\", \"& D11&\"; Nr. \"&D12","v":"Betrieb: , ; Nr. "},null,null,null,null,null,null,null,null,null,null,41,8,41,"Organisation-Beratung",4,"Organisation",null,null,8,"Zuschuss Qualifizierungsmaßnahmen",8,8,"Maschinen / Innenwirtschaft",null,8,"Herford-Bielefeld","VE Lübbecke",8,"41 Organisation-Beratung",null,"Herford-Bielefeld","VE Lübbecke"]
[null,"Name",null,null,null,null,"5. USt",0,{"$f":"K6+J6","v":0},"föfä brutto",null,null,42,9,42,"Organisation-Konzeption",4,"Organisation",null,null,9,"Barmittel (Guthaben)",9,9,"Maschinen /Außenwirtschaft",null,9,"Hochsauerland","VE Meschede",9,"42 Organisation-Konzeption",null,"Hochsauerland","VE Meschede"]
[null,"Ort",null,null,null,null,null,null,null,null,null,null,43,10,43,"Organisation-Geschäftsausgaben",4,"Organisation",null,null,10,"Steuer-Erstattung",10,10,"Viehzukauf",null,10,"Höxter","VE Brakel",10,"43 Organisation-Geschäftsausgaben",null,"Höxter","VE Brakel"]
[null,"B.-Nr.",null,"",null,null,null,null,null,null,null,null,51,11,51,"1.J. Startbeihilfen (Löhne/Soz.Abg)",5,"Startbeihilfen 1. Jahr",null,null,11,"Anderweitige Fördermittel",11,11,"Ablösung Verbindlichkeiten",null,11,"Kleve","VE Kleve",11,"51 1.J. Startbeihilfen (Löhne/Soz.Abg)",null,"Kleve","VE Kleve"]
[null,"Option:",null,66655665,2,"Auswahl der Optionen",null,null,null,null,null,null,52,12,52,"2.J. Startbeihilfen (Löhne/Soz.Abg)",6,"Startbeihilfen 2. Jahr",null,null,12,"Kontokorrent",12,12,"Finanzierungsnebenkosten",null,12,"Lippe","VE Brakel",12,"52 2.J. Startbeihilfen (Löhne/Soz.Abg)",null,"Lippe","VE Brakel"]
[null,"Anschrift:",null,null,null,null,null,null,null,null,null,null,53,13,53,"3.J. Startbeihilfen (Löhne/Soz.Abg)",7,"Startbeihilfen 2. Jahr",null,null,13,"Fremdkapital (Kredite)",13,13,"Organisation, Konzept",null,13,"Märkischer Kreis/Ennepe-Ruhr","VE Unna",13,"53 3.J. Startbeihilfen (Löhne/Soz.Abg)",null,"Märkischer Kreis/Ennepe-Ruhr","VE Unna"]
[null,"Bankverbindg",null,null,null,"",null,"",null,null,null,null,61,14,61,"SachAusg. Errichtung/Ausst.",8,"Sachausgaben Einr/Ausst",null,null,14,"Leistungen Dritter",14,14,"Startbeihilfen",null,14,"Mettmann","VE Lindlar",14,"61 SachAusg. Errichtung/Ausst.",null,"Mettmann","VE Lindlar"]
{"$rows_left_out":58}
{"sheet":"Tab2","index":3,"n_rows":1,"n_cols":14,"rows_kept":1,"cut":false,"hidden":false,"merged":[]}
["Buchung","Beleg","Gruppe","Rechnungsdatum","Zahlungsdatum","Firma","Verwendungszweck","Zahlung","nicht-real.Skonto","nicht ff. Ausgabe incl anteil. USt","ff. Brutto","anteil USt","Betragnetto","Antr"]

{"sheet":"Tab3","index":4,"n_rows":9,"n_cols":15,"rows_kept":9,"cut":false,"hidden":false,"merged":[[1,13,7,13],[6,0,6,1],[6,7,6,12]]}
["Betrieb:",null,null,{"$f":"\"   \"&'Tab1'!D10&\" in  \"&'Tab1'!D11","v":"    in  "},null,null,null,{"$f":"\"Unternehmer-Nr.:        \" &'Tab1'!D12","v":"Unternehmer-Nr.:        "}]
[null,null,null,null,null,null,null,null,null,null,null,null,null,"Ausz.-Antrag Nr."]
[]
[]
[]
[]
["Buchung",null,null,null,null,null,null,"Ausgaben in Euro"]
["Lfd. Nummer","Beleg-Nr.","KG","Rechnungs-datum","Zahlungs-datum","Firma","Gegenstand","Zahlung","nicht realisierte Skonti","nicht förderfähige Beträge","förderfähig Brutto","USt","zuwendungs-fähiger Betrag",null,"Bearbeitungsspalte der Kreisstelle"]
[1,2,3,4,5,6,7,8,9,10,11,12,13,14,15]

{"sheet":"Tab4","index":5,"n_rows":1,"n_cols":7,"rows_kept":1,"cut":false,"hidden":false,"merged":[]}
["lfd.Nr","Beleg","Datum","Art","Betrag","Art der Mittel","Ausz-Nr"]

{"sheet":"Tab5","index":6,"n_rows":9,"n_cols":8,"rows_kept":9,"cut":false,"hidden":false,"merged":[[5,0,7,0],[5,1,7,1],[5,6,7,6]]}
[]
[]
["Betrieb: ",null,{"$f":"\"   \"&'Tab1'!D10&\" in  \"&'Tab1'!D11","v":"    in  "}]
[{"$f":"\"Unternehmer-Nr.:        \" &'Tab1'!D12","v":"Unternehmer-Nr.:        "}]
[null,99]
[" Buchung Nr."," Beleg Nr.","Datum","Art","Betrag","Art ","Ausz.-Antrag Nr.","Bearbeitungsspalte"]
[null,null,"des",null,"in","der ",null," der "]
[null,null,"Zugangs","Code","Euro","Finanzierungsmittel",null,"Kreisstelle"]
[1,2,3,4,5,6,7,8]

{"sheet":"Tab6","index":7,"n_rows":77,"n_cols":10,"rows_kept":77,"cut":false,"hidden":false,"merged":[[0,2,0,3]]}
["Ausgaben",null,"alle Angaben in ",null,"Euro",null,null,"Bewilligter Kostenplan"]
["Num","Art","Ges.Betrag","nicht-ff.B.","ff.Betrag","USt","NettoBetrag","Betrag","nff u.USt","ffBetrag"]
[1,"Errichtung (GAK)",0,0,0,0,0,0,0,0]
[2,"Maschinen Anlagen (GAK)",0,0,0,0,0,0,0,0]
[3,"Allg. Aufwand (GAK)",0,0,0,0,0,0,0,0]
[4,"Organisation",0,0,0,0,0,0,0,0]
[5,"Startbeihilfen 1. Jahr",0,0,0,0,0,0,0,0]
[6,"Startbeihilfen 2. Jahr",0,0,0,0,0,0,0,0]
[7,"Startbeihilfen 3. Jahr",0,0,0,0,0,0,0,0]
[8,"Sachausgaben Einr/Ausst",0,0,0,0,0,0,0,0]
[9,"Sachausgaben Marketing,So.",0,0,0,0,0,0,0,0]
[10,"Bildungsmaßnahmen",0,0,0,0,0,0,0,0]
[11,"Sonstiges",0,0,0,0,0,0,0,0]
[null,"Summe",{"$f":"SUM(C3:C13)","v":0},{"$f":"SUM(D3:D13)","v":0},0,0,0,0,0,0]
[]
{"$rows_left_out":63}
{"sheet":"VNS1","index":8,"n_rows":50,"n_cols":9,"rows_kept":50,"cut":false,"hidden":false,"merged":[[29,4,29,6],[21,1,21,7],[6,1,6,8],[16,1,16,4],[16,5,16,7],[20,1,20,7],[30,2,30,3],[2,1,2,6],[33,1,35,1],[33,2,35,2],[33,3,35,3],[18,1,18,3],[32,5,32,6],[18,5,18,8],[19,1,19,8],[4,1,4,8],[30,4,30,6],[24,1,24,4],[23,1,23,4],[23,6,23,7],[31,1,31,4],[29,1,29,2],[31,6,31,7],[39,1,47,9],[33,4,35,4],[33,7,35,7],[33,8,35,8],[38,0,38,7],[37,0,37,8]]}
[]
[]
[null,"Förderung nach den Richtlinien über die Gewährung \nvon Zuwendungen für die Diversifizierung der Tätigkeiten \nim landwirtschaftlichen und landwirtschaftsnahen Bereich"]
[]
[]
[]
[]
[null,null,null,null,null,null,null,"Eingangsstempel"]
[null,"An den"]
[null,"Direktor der Landwirtschaftskammer NRW"]
[null,"als Landesbeauftragter"]
[null,"über den Geschäftsführer der Kreisstelle"]
[null,{"$f":"'Tab1'!E40","v":"VE Rheinkreise"},null,{"$f":"VLOOKUP(B13,Liste!B2:C4,2,1)","v":"Gartenstr. 11, 50765 Köln"}]
[]
["1. Zuwendungsempfänger"]
{"$rows_left_out":36}
{"sheet":"VNS2","index":9,"n_rows":52,"n_cols":7,"rows_kept":52,"cut":false,"hidden":false,"merged":[[38,2,38,3],[45,4,45,6]]}
[]
[null,"3. Zahlenmäßiger Nachweis der Finanzierungsmittel"]
[null,0,"alle Angaben in Euro"]
[null,null," Einnahmen",null,"laut Zuwendungsbescheid",null,"laut Abrechnung"]
[null,null,"1.","Zuschuss aus GAK-Förderung",{"$f":"'Tab6'!E40","v":0},null,{"$f":"'Tab6'!C21","v":0}]
[null,null,"2.","Zuschuss für Organisation, Konzeption",{"$f":"'Tab6'!E41","v":0},null,{"$f":"'Tab6'!C22","v":0}]
[null,null,"3.","Zuschuss für  Ausstattung, Einrichtung",{"$f":"'Tab6'!E42","v":0},null,{"$f":"'Tab6'!C23","v":0}]
[null,null,"4.","Zuschuss für Marketing und Sonstiges",{"$f":"'Tab6'!E43","v":0},null,{"$f":"'Tab6'!C24","v":0}]
[null,null,"5.","Zuschuss für Startbeihilfe 1. Jahr",{"$f":"'Tab6'!E44","v":0},null,{"$f":"'Tab6'!C25","v":0}]
[null,null,"6.","Zuschuss für Startbeihilfe 2. Jahr",{"$f":"'Tab6'!E45","v":0},null,{"$f":"'Tab6'!C26","v":0}]
[null,null,"7.","Zuschuss für Startbeihilfe 3. Jahr",{"$f":"'Tab6'!E46","v":0},null,{"$f":"'Tab6'!C27","v":0}]
[null,null,"8.","Zuschuss zu Qualifizierungsmaßnahmen",{"$f":"'Tab6'!E47","v":0},null,{"$f":"'Tab6'!C28","v":0}]
[null,null,null,"Zuschüsse zusammen",{"$f":"SUM(E5:E12)","v":0},null,{"$f":"SUM(G5:G12)","v":0}]
[null,null,"9.","Bare Eigenmittel (Guthaben)",{"$f":"'Tab6'!E48","v":0},null,{"$f":"'Tab6'!C29","v":0}]
[null,null,"10.","USt-Erstattung",{"$f":"'Tab6'!E49","v":0},null,{"$f":"'Tab6'!C30","v":0}]
{"$rows_left_out":38}
{"sheet":"VNS3","index":10,"n_rows":53,"n_cols":8,"rows_kept":53,"cut":false,"hidden":false,"merged":[[21,2,21,11]]}
[]
[]
[null,"6. Prüfungsvermerk des Geschäftsführers der Kreisstelle"]
[]
[null,"Der Verwendungsnachweis wurde geprüft"]
[]
[null,null," nach Aktenlage"]
[]
[null,null," nach Aktenlage und örtlicher Besichtigung"]
[null,"Ergebnis"]
[null,null," Der Verwendungsnachweis entspricht den im Zuwendungsbescheid einschl. der in den Neben-"]
[null,null," bestimmungen festgelegten Anforderungen. Die Zuwendung ist zweckentsprechend verwendet "]
[null,null," worden. "]
[]
[null,null," Der Verwendungsnachweis ist vollständig (einschl. Sachbericht, Originalrechnungen, "]
{"$rows_left_out":39}
{"sheet":"VNS4","index":11,"n_rows":27,"n_cols":11,"rows_kept":27,"cut":false,"hidden":false,"merged":[[7,3,7,5],[7,6,7,8],[5,4,6,4]]}
[]
[null,"Kosten der Diversifizierungsmaßnahme",null,null,null,null,"Kosten bis Durchf.-Jahr",null,{"$f":"AusAn!H17","v":1},null,"Anlage A"]
[null,"2. Ausgabengliederung",null,null,"alle Angaben in ","Euro",null,null,null,null,"Prüfung Kreisstelle"]
[null,null,null,"2.1  laut Konzept und Antrag ",null,null,"2.2   Tatsächlich entstandene Ausgaben",null,null,null," "]
[null,"Ausgabenbereich",null,"Investitionsbetrag (Brutto einschl. Eigenleistung)","USt und nicht förderfähige \nKosten","förderfähiger\n Betrag","Investitionsbetrag (Brutto einschl. Eigenleistung)","USt und nicht förderfähige \nKosten","förderfähiger\nBetrag",null,"geprüft und anerkannt"]
[]
[]
[null,null,null,"Erfassungsdialog",null,null,"aus Abrechnung"]
[null,"Errichtung (GAK)",1,{"$f":"'Tab6'!H3","v":0},{"$f":"'Tab6'!I3","v":0},{"$f":"'Tab6'!J3","v":0},{"$f":"'Tab6'!C3","v":0},{"$f":"'Tab6'!D3+'Tab6'!F3","v":0},{"$f":"'Tab6'!G3","v":0}]
[null,"Maschinen, Anlagen (GAK)",2,{"$f":"'Tab6'!H4","v":0},{"$f":"'Tab6'!I4","v":0},{"$f":"'Tab6'!J4","v":0},{"$f":"'Tab6'!C4","v":0},{"$f":"'Tab6'!D4+'Tab6'!F4","v":0},{"$f":"'Tab6'!G4","v":0}]
[null,"Allg. Aufwand (GAK)",3,{"$f":"'Tab6'!H5","v":0},{"$f":"'Tab6'!I5","v":0},{"$f":"'Tab6'!J5","v":0},{"$f":"'Tab6'!C5","v":0},{"$f":"'Tab6'!D5+'Tab6'!F5","v":0},{"$f":"'Tab6'!G5","v":0}]
[null,"Organisation",4,{"$f":"'Tab6'!H6","v":0},{"$f":"'Tab6'!I6","v":0},{"$f":"'Tab6'!J6","v":0},{"$f":"'Tab6'!C6","v":0},{"$f":"'Tab6'!D6+'Tab6'!F6","v":0},{"$f":"'Tab6'!G6","v":0}]
[null,"1. J. Löhne, Sozialabg.",5,{"$f":"'Tab6'!H7","v":0},{"$f":"'Tab6'!I7","v":0},{"$f":"'Tab6'!J7","v":0},{"$f":"'Tab6'!C7","v":0},{"$f":"'Tab6'!D7+'Tab6'!F7","v":0},{"$f":"'Tab6'!G7","v":0}]
[null,"2. J. Löhne, Sozialabg.",6,{"$f":"'Tab6'!H8","v":0},{"$f":"'Tab6'!I8","v":0},{"$f":"'Tab6'!J8","v":0},{"$f":"'Tab6'!C8","v":0},{"$f":"'Tab6'!D8+'Tab6'!F8","v":0},{"$f":"'Tab6'!G8","v":0}]
[null,"3. J. Löhne, Sozialabg.",7,{"$f":"'Tab6'!H9","v":0},{"$f":"'Tab6'!I9","v":0},{"$f":"'Tab6'!J9","v":0},{"$f":"'Tab6'!C9","v":0},{"$f":"'Tab6'!D9+'Tab6'!F9","v":0},{"$f":"'Tab6'!G9","v":0}]
{"$rows_left_out":13}
{"sheet":"AusAn","index":12,"n_rows":71,"n_cols":16,"rows_kept":71,"cut":false,"hidden":false,"merged":[[10,7,10,8],[16,5,16,6],[17,3,17,5],[13,2,13,4],[52,1,53,8],[37,1,38,8],[59,5,59,8],[70,5,70,8],[45,1,47,8],[48,1,51,8],[23,1,26,4],[23,5,24,7],[54,1,54,8]]}
[]
[null,"Antragsteller/in; Absender:"]
[null,null,{"$f":"'Tab1'!F10 &\" \"&'Tab1'!D10","v":" "}]
[null,null,{"$f":"'Tab1'!D14","v":0}]
[null,null,{"$f":"'Tab1'!F11 &\"  \"&'Tab1'!D11","v":"  "}]
[null,"z.H.",0]
[]
[null,"An den Direktor der Landwirtschaftskammer NRW"]
[null,"als Landesbeauftragter"]
[null,"EU-Zahlstelle, Förderung"]
[null,null,null,null,null,null,null,"Eingangsstempel"]
[]
[]
[null,"über",{"$f":"'Tab1'!E40","v":"VE Rheinkreise"},null,null,{"$f":"VLOOKUP(C14,Liste!B2:C4,2)","v":"Gartenstr. 11, 50765 Köln"}]
[]
{"$rows_left_out":57}
{"sheet":"Aufteilung","index":13,"n_rows":39,"n_cols":16,"rows_kept":39,"cut":false,"hidden":true,"merged":[]}
[]
[null,null,{"$f":"VLOOKUP(C4,'Tab1'!$O$2:$P$18,2,0)","v":"GAK: Allg. Aufwand: Ingenieurl."},{"$f":"VLOOKUP(D4,'Tab1'!$O$2:$P$18,2,0)","v":"GAK: Allg. Aufw: Baunebenkosten"},{"$f":"VLOOKUP(E4,'Tab1'!$O$2:$P$18,2,0)","v":"GAK: Allg. Aufwand: Architekt"},{"$f":"VLOOKUP(F4,'Tab1'!$O$2:$P$18,2,0)","v":{"$error":"#N/A"}},{"$f":"VLOOKUP(G4,'Tab1'!$O$2:$P$18,2,0)","v":{"$error":"#N/A"}},{"$f":"VLOOKUP(H4,'Tab1'!$O$2:$P$18,2,0)","v":{"$error":"#N/A"}},{"$f":"VLOOKUP(I4,'Tab1'!$O$2:$P$18,2,0)","v":{"$error":"#N/A"}},{"$f":"VLOOKUP(J4,'Tab1'!$O$2:$P$18,2,0)","v":{"$error":"#N/A"}},{"$f":"VLOOKUP(K4,'Tab1'!$O$2:$P$18,2,0)","v":{"$error":"#N/A"}},{"$f":"VLOOKUP(L4,'Tab1'!$O$2:$P$18,2,0)","v":{"$error":"#N/A"}},{"$f":"VLOOKUP(M4,'Tab1'!$O$2:$P$18,2,0)","v":{"$error":"#N/A"}},{"$f":"VLOOKUP(N4,'Tab1'!$O$2:$P$18,2,0)","v":{"$error":"#N/A"}},null,"Total"]
[null,null,"Gruppe"]
[null,"Antr",32,35,31,"Gesamtergebnis"]
[null,1]
[null,"Gesamtergebnis"]
[]
[]
[]
[]
[]
[]
[]
[]
[null,"Aufteilung der nachgewiesenen Kosten"]
{"$rows_left_out":25}
{"sheet":"Betreuer","index":14,"n_rows":45,"n_cols":9,"rows_kept":45,"cut":false,"hidden":true,"merged":[]}
["AF08_BETREUER_NR","AF08_NAME","AF08_VORNAME","AF08_STRASSE","AF08_PLZ","AF08_ORT","AF08_TELEFON","AF08_KRST_NR","AF08_EMAIL"]
[0,"ohne Betreuer","","",null,"","",499,""]
[60,"BSt. Köln - Frau B. Biermann","Birgit","Gartenstr. 11 a",50765,"Köln-Auweiler","0221/5340-108",402,"birgit.biermann@lwk.nrw.de"]
[62,"BSt.Steinfurt-Fr.Jürgensmeier","Susanne","Hembergener Str. 10",48369,"Saerbeck","02574/9277-26",618,"susanne.juergensmeier-lotz@lwk.nrw.de"]
[61,"BSt. Paderborn - Frau W. Kuck","Walburga","Bleichstr. 41",33102,"Paderborn","05251/1354-55",613,"walburga.kuck@lwk.nrw.de"]
[65,"agrar man GmbH-Frau Schonvogel","","Wiefelsteder Straße 171",26316,"Varel-Bramloge","04456/899870",400,"info@agrarman.de"]
[64,"BSt. Coesfeld - Frau Wettels","Hanna","Johann-Walling-Str. 45",45325,"Borken","02861-922 752",601,"hanna.wettels@lwk.nrw.de"]
[63,"BSt. Soest - Frau Thörner","Karin","Ostinghausen (Haus Düsse)",59505,"Bad Sassendorf","02945-989 536",617,"karin.thoerner@lwk.nrw.de"]
[50,"LUB GmbH - Frau Bergmann","Margret ","Waldenburger Straße 6 ",48231,"Warendorf ","0 25 81 63 79-36",619,"Margret.Bergmann@lwk.nrw.de"]
[37,"LUB GmbH - Frau Biermann","Dorothee","Dünnefeldweg 13",59872,"Meschede","0291/991562",606,"Dorothee.Biermann@lwk.nrw.de"]
[35,"Telle","Martin","Timbergstrasse 51",58513,"Lüdenscheid","02351 14215",499,""]
[34,"Weifels","Klaus","Im Rottfeld 25",41462,"Neuss","02131/541296",499,"heinz.anette.weifels@t-online.de"]
[33,"Mews","Klaus","Gildehauser Weg 239",48529,"Nordhorn","05921/13120",499,"klaus.mews@t-online.de"]
[32,"Massier","Hubert","Asternweg 6",41363,"Jüchen","02182/5538",499,"h.massier@t-online.de"]
[31,"LUM - Herr Erkelenz","Lutz","Grünscheid 25",42799,"Leichlingen","02175 /166206",499,""]
{"$rows_left_out":31}
{"sheet":"Updates","index":15,"n_rows":37,"n_cols":6,"rows_kept":37,"cut":false,"hidden":true,"merged":[]}
[null,"Version","Ausgabe","Datum Freigabe","Nr.","Änderungen"]
[null,"2","1.10.08",null,null,"Zahlreiche Änderungen nach Angabe von Frau Kloß (siehe Unterlagen)"]
[null,null,null,null,null,"z.B. Löschen bestimmter Seiten, die nicht benötigt werden"]
[null,null,null,null,null,"Aufnahme eines Verwendungszwecks zu allen Belegen"]
[null,null,null,null,null,"Anpassung an neue Auslegung der ELER-Abrechnungsverordnung"]
[]
[null,null,null,null,null,"Realisierung des Einlesens aus Antragsdatei, z.b. Betriebsidentifikation und Fördermittel"]
[]
[null,null,null,null,null,"Überlegungen zu Einzeldarstellung für jeden Auszahlungsantrag"]
[]
[null,null,null,null,null,"Vorbereiten der Daten zum automatischen Auslesen"]
[]
[null,null,"27.04.09",null,null,"Fehler bei Löschen beseitigt"]
[null,null,null,null,null,"Dialogwerte im Kostenplan nach Speichern auf 0 setzen"]
[]
{"$rows_left_out":23}
{"sheet":"Liste","index":16,"n_rows":4,"n_cols":3,"rows_kept":4,"cut":false,"hidden":true,"merged":[]}
[]
[1,"VE Höxter-Lippe-Paderborn","Bohlenweg 3, 33034 Brakel"]
[2,"VE Rheinkreise","Gartenstr. 11, 50765 Köln"]
[3,"VE Steinfurt","Hembergener Straße 10, 48369 Saerbeck"]

{"sheet":"transfer","index":17,"n_rows":61,"n_cols":6,"rows_kept":61,"cut":false,"hidden":true,"merged":[]}
[235689,null,"Adressnummer",{"$f":"IF(ISTEXT(A1),\"o.k\",\"Fehler \")","v":"Fehler "}]
[{"$f":"AusAn!H17","v":1},null,"Nummer des Auszahlungsantrages",{"$f":"IF(ISNUMBER(A2),\"o.k\",\"Fehler \")","v":"o.k"}]
[{"$f":"AusAn!H41","v":1},null,"Nr. Grundantrag",{"$f":"IF(ISNUMBER(A3),\"o.k\",\"Fehler \")","v":"o.k"}]
[{"$f":"AusAn!#REF!","v":{"$error":"#REF!"}},null,"Jahr Grundantrag",{"$f":"IF(ISNUMBER(A4),\"o.k\",\"Fehler \")","v":"Fehler "}]
[{"$f":"AusAn!C3","v":" "},null,"Name Antrag",{"$f":"IF(ISTEXT(A5),\"o.k\",\"Fehler \")","v":"o.k"}]
[{"$f":"AusAn!C4","v":0},null,"Anschrift Antrag",{"$f":"IF(ISTEXT(A6),\"o.k\",\"Fehler \")","v":"Fehler "}]
[{"$f":"AusAn!C5","v":"  "},null,"PLZ und Ort Antrag",{"$f":"IF(ISTEXT(A7),\"o.k\",\"Fehler \")","v":"o.k"}]
[{"$f":"AusAn!E14","v":0},null,"Kreisstelle",{"$f":"IF(ISTEXT(A8),\"o.k\",\"Fehler \")","v":"Fehler "}]
[{"$f":"AusAn!D18","v":0},null,"Aktenzeichen",{"$f":"IF(ISTEXT(A9),\"o.k\",\"Fehler \")","v":"Fehler "}]
[{"$f":"AusAn!G19","v":"00:00:00"},null,"Datum Verwendungsnachweis",{"$f":"IF(ISNUMBER(A10),\"o.k\",\"Fehler \")","v":"o.k"}]
[{"$f":"AusAn!H28","v":0},null,"beantragte Zahlung von Zuschuss GAK",{"$f":"IF(ISNUMBER(A11),\"o.k\",\"Fehler \")","v":"o.k"},null,"~ Investitionen nach GAK"]
[{"$f":"AusAn!H29","v":0},null,"beantragte Zahlung für Organis,Konz,Beratg",{"$f":"IF(ISNUMBER(A12),\"o.k\",\"Fehler \")","v":"o.k"},null,"~ Organisation, Konzeption, Beratung"]
[{"$f":"AusAn!H30","v":0},null,"beantragte Zahlung Einrichtung, Ausstattung","o.k",null,"~ Einrichtung und Ausstattung"]
[{"$f":"AusAn!H31","v":0},null,"beantragte Zahlung Marketing; Sonstiges","o.k",null,"~ Marketing und Sonstiges"]
[{"$f":"AusAn!H32","v":0},null,"beantragte Startbeihilfe 1. J.","o.k",null,"~ Startbeihilfen für 1. Jahr"]
{"$rows_left_out":47}
{"sheet":"Rechenhilfe Beleg","index":24,"n_rows":32,"n_cols":16,"rows_kept":32,"cut":false,"hidden":false,"merged":[[18,0,19,0],[18,1,19,1],[21,12,21,13],[0,12,0,13],[18,2,18,6],[18,7,18,11],[3,2,3,6],[3,7,3,11],[3,0,4,0],[3,1,4,1]]}
["Rechenhilfe Beleg",null,null,null,null,null,null,null,null,null,null,null,"Eingabefelder"]
["Rechnung (Nettobetrag)",null,"brutto",23800,{"$f":"IF(D2>0,IF(B24<>D2,\"   Vorsicht Rundungsdifferenz!\",\"\"), \"   Eingabe Bruttobetrag fehlt\")","v":""}]
[]
["Position, Nr., etc","gesamt","nicht zuwendungsfähig netto",null,null,null,null,"zuwendungsfähig netto",null,null,null,null,null,null,null,0]
[null,null,null,null,null,null,"gesamt",null,null,null,null,"gesamt"]
[1,{"$f":"G6+L6","v":5000},null,null,3000,2000,{"$f":"SUM(C6:F6)","v":5000},null,null,null,null,{"$f":"SUM(H6:K6)","v":0}]
[2,15000,null,null,null,null,{"$f":"SUM(C7:F7)","v":0},null,null,15000,null,{"$f":"SUM(H7:K7)","v":15000}]
[null,0,null,null,null,null,0,null,null,null,null,0]
[null,0,null,null,null,null,0,null,null,null,null,0]
[null,0,null,null,null,null,0,null,null,null,null,0]
[null,0,null,null,null,null,0,null,null,null,null,0]
[null,0,null,null,null,null,0,null,null,null,null,0]
[null,0,null,null,null,null,0,null,null,null,null,0]
[null,0,null,null,null,null,0,null,null,null,null,0]
[null,0,null,null,null,null,0,null,null,null,null,0]
{"$rows_left_out":17}